Target
G-protein coupled receptor 55
Ligand
BDBM76065
Substrate
Meas. Tech.
SAR Analysis of Selective Antagonists of GPR55 using an Image-Based Assay - Set 4
IC50
>32000±n/a nM
Citation
 PubChem, PC SAR Analysis of Selective Antagonists of GPR55 using an Image-Based Assay - Set 4 PubChem Bioassay (2010)[AID] 
Target
Name:
G-protein coupled receptor 55
Synonyms:
G protein-coupled receptor 55 GPR55_HUMAN
Type:
PROTEIN
Mol. Mass.:
36649.72
Organism:
Homo sapiens (Human)
Description:
ChEMBL_1292265
Residue:
319
  
Inhibitor
Name:
BDBM76065
Synonyms:
2-(4-methoxyphenyl)-7-methyl-4-(4-phenylphenyl)pyrazolo[3,4-d]pyridazine cid_1214658
Type:
Small organic molecule
Emp. Form.:
C25H20N4O
Mol. Mass.:
392.4525
SMILES:
COc1ccc(cc1)-n1cc2c(nnc(C)c2n1)-c1ccc(cc1)-c1ccccc1
: