Target
G-protein coupled receptor 55
Ligand
BDBM76082
Substrate
Meas. Tech.
SAR Analysis of Selective Antagonists of GPR55 using an Image-Based Assay - Set 4
IC50
15600±n/a nM
Citation
 PubChem, PC SAR Analysis of Selective Antagonists of GPR55 using an Image-Based Assay - Set 4 PubChem Bioassay (2010)[AID] 
Target
Name:
G-protein coupled receptor 55
Synonyms:
G protein-coupled receptor 55 GPR55_HUMAN
Type:
PROTEIN
Mol. Mass.:
36649.72
Organism:
Homo sapiens (Human)
Description:
ChEMBL_1292265
Residue:
319
  
Inhibitor
Name:
BDBM76082
Synonyms:
(6Z)-3-ethoxy-6-[4-(4-methoxyphenyl)-5-methyl-1,2-dihydropyrazol-3-ylidene]-1-cyclohexa-2,4-dienone (6Z)-3-ethoxy-6-[4-(4-methoxyphenyl)-5-methyl-3-pyrazolin-3-ylidene]cyclohexa-2,4-dien-1-one cid_5423853
Type:
Small organic molecule
Emp. Form.:
C19H20N2O3
Mol. Mass.:
324.3737
SMILES:
CCOc1ccc(-c2n[nH]c(C)c2-c2ccc(OC)cc2)c(O)c1
: