Target
Beta-galactosidase
Ligand
BDBM52665
Substrate
Meas. Tech.
HTS Dose response counterscreen for assays utilizing the enzyme, beta-galactosidase - Set 2
EC50
16834±n/a nM
Citation
 PubChem, PC HTS Dose response counterscreen for assays utilizing the enzyme, beta-galactosidase - Set 2 PubChem Bioassay (2010)[AID] 
Target
Name:
Beta-galactosidase
Synonyms:
BGAL_ECOLX Lactase | lacZ
Type:
PROTEIN
Mol. Mass.:
116943.87
Organism:
Escherichia coli
Description:
ChEMBL_215882
Residue:
1029
  
Inhibitor
Name:
BDBM52665
Synonyms:
1-(5-acetyl-3-methyl-6-phenyl-5H-[1,2,4]triazolo[3,4-b][1,3,4]thiadiazin-7-yl)ethanone 1-(5-ethanoyl-3-methyl-6-phenyl-[1,2,4]triazolo[3,4-b][1,3,4]thiadiazin-7-yl)ethanone SMR000312275 | cid_5295671
Type:
Small organic molecule
Emp. Form.:
C15H14N4O2S
Mol. Mass.:
314.362
SMILES:
CC(=O)N1C(=C(Sc2nnc(C)n12)C(C)=O)c1ccccc1
: