Target
Beta-galactosidase
Ligand
BDBM67308
Substrate
Meas. Tech.
HTS Dose response counterscreen for assays utilizing the enzyme, beta-galactosidase - Set 2
EC50
31300±n/a nM
Citation
 PubChem, PC HTS Dose response counterscreen for assays utilizing the enzyme, beta-galactosidase - Set 2 PubChem Bioassay (2010)[AID] 
Target
Name:
Beta-galactosidase
Synonyms:
BGAL_ECOLX Lactase | lacZ
Type:
PROTEIN
Mol. Mass.:
116943.87
Organism:
Escherichia coli
Description:
ChEMBL_215882
Residue:
1029
  
Inhibitor
Name:
BDBM67308
Synonyms:
4-[1-(4-methylphenyl)-2-nitro-ethyl]sulfanylaniline 4-[[1-(4-methylphenyl)-2-nitroethyl]thio]aniline MLS000861888 [4-[[2-nitro-1-(p-tolyl)ethyl]thio]phenyl]amine | cid_2733001
Type:
Small organic molecule
Emp. Form.:
C15H16N2O2S
Mol. Mass.:
288.365
SMILES:
Cc1ccc(cc1)C(C[N+]([O-])=O)Sc1ccc(N)cc1
: