Target
NACHT, LRR and PYD domains-containing protein 3
Ligand
BDBM76279
Substrate
Meas. Tech.
Dose Response confirmation of inhibitors of NALP3 in yeast using a Caspase-1-ASC counter screen
IC50
4850±n/a nM
Citation
 PubChem, PC Dose Response confirmation of inhibitors of NALP3 in yeast using a Caspase-1-ASC counter screen PubChem Bioassay (2010)[AID] 
Target
Name:
NACHT, LRR and PYD domains-containing protein 3
Synonyms:
C1orf7 NALP3 NLRP3 protein PYPAF1
Type:
Enzyme Catalytic Domain
Mol. Mass.:
118173.88
Organism:
Homo sapiens (Human)
Description:
Q96P20
Residue:
1036
  
Inhibitor
Name:
BDBM76279
Synonyms:
3-(4-ethoxyphenyl)-6-propyl-1-cyclohex-2-enone 3-(4-ethoxyphenyl)-6-propyl-cyclohex-2-en-1-one 3-p-phenetyl-6-propyl-cyclohex-2-en-1-one SMR000496134 | cid_2841181
Type:
Small organic molecule
Emp. Form.:
C17H22O2
Mol. Mass.:
258.3554
SMILES:
CCCC1CCC(=CC1=O)c1ccc(OCC)cc1
: