Target
NACHT, LRR and PYD domains-containing protein 3
Ligand
BDBM76294
Substrate
Meas. Tech.
Dose Response confirmation of inhibitors of NALP3 in yeast using a Caspase-1-ASC counter screen
IC50
1050±n/a nM
Citation
 PubChem, PC Dose Response confirmation of inhibitors of NALP3 in yeast using a Caspase-1-ASC counter screen PubChem Bioassay (2010)[AID] 
Target
Name:
NACHT, LRR and PYD domains-containing protein 3
Synonyms:
C1orf7 NALP3 NLRP3 protein PYPAF1
Type:
Enzyme Catalytic Domain
Mol. Mass.:
118173.88
Organism:
Homo sapiens (Human)
Description:
Q96P20
Residue:
1036
  
Inhibitor
Name:
BDBM76294
Synonyms:
3-(benzenesulfonyl)-N-(4-fluoro-1,3-benzothiazol-2-yl)-N-(3-morpholin-4-ylpropyl)propanamide;hydrochloride 3-besyl-N-(4-fluoro-1,3-benzothiazol-2-yl)-N-(3-morpholinopropyl)propionamide;hydrochloride N-(4-fluoranyl-1,3-benzothiazol-2-yl)-N-(3-morpholin-4-ylpropyl)-3-(phenylsulfonyl)propanamide;hydrochloride cid_18581701
Type:
Small organic molecule
Emp. Form.:
C23H26FN3O4S2
Mol. Mass.:
491.599
SMILES:
Fc1cccc2sc(nc12)N(CCCN1CCOCC1)C(=O)CCS(=O)(=O)c1ccccc1
: