Target
NACHT, LRR and PYD domains-containing protein 3
Ligand
BDBM76299
Substrate
Meas. Tech.
Dose Response confirmation of inhibitors of NALP3 in yeast using a Caspase-1-ASC counter screen
IC50
1080±n/a nM
Citation
 PubChem, PC Dose Response confirmation of inhibitors of NALP3 in yeast using a Caspase-1-ASC counter screen PubChem Bioassay (2010)[AID] 
Target
Name:
NACHT, LRR and PYD domains-containing protein 3
Synonyms:
C1orf7 NALP3 NLRP3 protein PYPAF1
Type:
Enzyme Catalytic Domain
Mol. Mass.:
118173.88
Organism:
Homo sapiens (Human)
Description:
Q96P20
Residue:
1036
  
Inhibitor
Name:
BDBM76299
Synonyms:
(8-amino-10-phenyl-phenazin-10-ium-2-yl)-diethyl-amine;chloride MLS001359835 N2,N2-diethyl-10-phenyl-phenazin-10-ium-2,8-diamine;chloride SMR001224409 | cid_2733867
Type:
Small organic molecule
Emp. Form.:
C22H23N4
Mol. Mass.:
343.4443
SMILES:
CC[N+](CC)=c1ccc2nc3ccc(N)cc3n(-c3ccccc3)c2c1
: