Target
Intestinal-type alkaline phosphatase
Ligand
BDBM49122
Substrate
Meas. Tech.
Dose Response concentration confirmation of uHTS hits from a small molecule activators of human intestinal alkaline phosphatase via a luminescent assay - Set 2
EC50
8880±n/a nM
Citation
 PubChem, PC Dose Response concentration confirmation of uHTS hits from a small molecule activators of human intestinal alkaline phosphatase via a luminescent assay - Set 2 PubChem Bioassay (2010)[AID] 
Target
Name:
Intestinal-type alkaline phosphatase
Synonyms:
ALPI Intestinal alkaline phosphatase | PPBI_HUMAN
Type:
PROTEIN
Mol. Mass.:
56804.94
Organism:
Homo sapiens (Human)
Description:
ChEMBL_1278525
Residue:
528
  
Inhibitor
Name:
BDBM49122
Synonyms:
2-amino-3-hydroxy-N'-(2,3,4-trihydroxybenzyl)propionohydrazide;hydrochloride 2-azanyl-3-oxidanyl-N'-[[2,3,4-tris(oxidanyl)phenyl]methyl]propanehydrazide;hydrochloride Benserazide SMR000058421 | cid_26964
Type:
Small organic molecule
Emp. Form.:
C10H15N3O5
Mol. Mass.:
257.2432
SMILES:
NC(CO)C(=O)NNCc1ccc(O)c(O)c1O
: