Target
Intestinal-type alkaline phosphatase
Ligand
BDBM75613
Substrate
Meas. Tech.
Dose Response concentration confirmation of uHTS hits from a small molecule activators of human intestinal alkaline phosphatase via a luminescent assay - Set 2
EC50
3660±n/a nM
Citation
 PubChem, PC Dose Response concentration confirmation of uHTS hits from a small molecule activators of human intestinal alkaline phosphatase via a luminescent assay - Set 2 PubChem Bioassay (2010)[AID] 
Target
Name:
Intestinal-type alkaline phosphatase
Synonyms:
ALPI Intestinal alkaline phosphatase | PPBI_HUMAN
Type:
PROTEIN
Mol. Mass.:
56804.94
Organism:
Homo sapiens (Human)
Description:
ChEMBL_1278525
Residue:
528
  
Inhibitor
Name:
BDBM75613
Synonyms:
(2Z)-9-(3-chlorophenyl)-2-(5-ethoxy-6-keto-cyclohexa-2,4-dien-1-ylidene)-8-keto-1,7-dihydropurine-6-carboxamide (2Z)-9-(3-chlorophenyl)-2-(5-ethoxy-6-oxo-1-cyclohexa-2,4-dienylidene)-8-oxo-1,7-dihydropurine-6-carboxamide MLS000102658 cid_6324587
Type:
Small organic molecule
Emp. Form.:
C20H16ClN5O4
Mol. Mass.:
425.825
SMILES:
CCOc1cccc(c1O)-c1nc(C(N)=O)c2[nH]c(=O)n(-c3cccc(Cl)c3)c2n1
: