Target
Intestinal-type alkaline phosphatase
Ligand
BDBM65353
Substrate
Meas. Tech.
Dose Response concentration confirmation of uHTS hits from a small molecule activators of human intestinal alkaline phosphatase via a luminescent assay - Set 2
EC50
8970±n/a nM
Citation
 PubChem, PC Dose Response concentration confirmation of uHTS hits from a small molecule activators of human intestinal alkaline phosphatase via a luminescent assay - Set 2 PubChem Bioassay (2010)[AID] 
Target
Name:
Intestinal-type alkaline phosphatase
Synonyms:
ALPI Intestinal alkaline phosphatase | PPBI_HUMAN
Type:
PROTEIN
Mol. Mass.:
56804.94
Organism:
Homo sapiens (Human)
Description:
ChEMBL_1278525
Residue:
528
  
Inhibitor
Name:
BDBM65353
Synonyms:
4-bromanyl-N'-[(E)-(4-ethoxy-6-oxidanylidene-cyclohexa-2,4-dien-1-ylidene)methyl]-1H-pyrazole-5-carbohydrazide 4-bromo-N'-[(E)-(4-ethoxy-6-oxo-1-cyclohexa-2,4-dienylidene)methyl]-1H-pyrazole-5-carbohydrazide MLS000716288 cid_5923073
Type:
Small organic molecule
Emp. Form.:
C13H13BrN4O3
Mol. Mass.:
353.171
SMILES:
CCOc1ccc(C=NNC(=O)c2[nH]ncc2Br)c(O)c1
: