Target
Intestinal-type alkaline phosphatase
Ligand
BDBM58504
Substrate
Meas. Tech.
Dose Response concentration confirmation of uHTS hits from a small molecule activators of human intestinal alkaline phosphatase via a luminescent assay - Set 2
EC50
8920±n/a nM
Citation
 PubChem, PC Dose Response concentration confirmation of uHTS hits from a small molecule activators of human intestinal alkaline phosphatase via a luminescent assay - Set 2 PubChem Bioassay (2010)[AID] 
Target
Name:
Intestinal-type alkaline phosphatase
Synonyms:
ALPI Intestinal alkaline phosphatase | PPBI_HUMAN
Type:
PROTEIN
Mol. Mass.:
56804.94
Organism:
Homo sapiens (Human)
Description:
ChEMBL_1278525
Residue:
528
  
Inhibitor
Name:
BDBM58504
Synonyms:
1-(4-amino-1,2,5-oxadiazol-3-yl)-5-methyl-N'-[(Z)-(2-oxo-1-naphthalenylidene)methyl]-4-triazolecarbohydrazide 1-(4-aminofurazan-3-yl)-N'-[(Z)-(2-keto-1-naphthylidene)methyl]-5-methyl-triazole-4-carbohydrazide MLS000950073 cid_24789706
Type:
Small organic molecule
Emp. Form.:
C17H14N8O3
Mol. Mass.:
378.3449
SMILES:
Cc1c(nnn1-c1nonc1N)C(=O)NN=Cc1c(O)ccc2ccccc12
: