Target
Intestinal-type alkaline phosphatase
Ligand
BDBM75692
Substrate
Meas. Tech.
Dose Response concentration confirmation of uHTS hits from a small molecule activators of human intestinal alkaline phosphatase via a luminescent assay - Set 2
EC50
7330±n/a nM
Citation
 PubChem, PC Dose Response concentration confirmation of uHTS hits from a small molecule activators of human intestinal alkaline phosphatase via a luminescent assay - Set 2 PubChem Bioassay (2010)[AID] 
Target
Name:
Intestinal-type alkaline phosphatase
Synonyms:
ALPI Intestinal alkaline phosphatase | PPBI_HUMAN
Type:
PROTEIN
Mol. Mass.:
56804.94
Organism:
Homo sapiens (Human)
Description:
ChEMBL_1278525
Residue:
528
  
Inhibitor
Name:
BDBM75692
Synonyms:
MLS001235951 N'-[1-(3-methylphenyl)pyrazolo[3,4-d]pyrimidin-4-yl]furan-2-carbohydrazide SMR000807172 | cid_8489109
Type:
Small organic molecule
Emp. Form.:
C17H14N6O2
Mol. Mass.:
334.3321
SMILES:
Cc1cccc(c1)-n1ncc2c(NNC(=O)c3ccco3)ncnc12
: