Target
Intestinal-type alkaline phosphatase 1
Ligand
BDBM51017
Substrate
Meas. Tech.
Dose Response confirmation of uHTS inhibitors of Human Intestinal Alkaline Phosphatase using Mouse Intestinal Alkaline Phosphatase
IC50
33400±n/a nM
Citation
 PubChem, PC Dose Response confirmation of uHTS inhibitors of Human Intestinal Alkaline Phosphatase using Mouse Intestinal Alkaline Phosphatase PubChem Bioassay (2010)[AID] 
Target
Name:
Intestinal-type alkaline phosphatase 1
Synonyms:
Alpi | PPBI1_RAT
Type:
Enzyme Catalytic Domain
Mol. Mass.:
58396.39
Organism:
Rattus norvegicus (Rat)
Description:
P15693
Residue:
540
  
Inhibitor
Name:
BDBM51017
Synonyms:
(5E)-3-allyl-2-thioxo-5-[(2E)-2-(1,3,3-trimethyl-1,3-dihydro-2H-indol-2-ylidene)ethylidene]-1,3-thiazolidin-4-one (5E)-3-prop-2-enyl-2-sulfanylidene-5-[(2E)-2-(1,3,3-trimethyl-2-indolylidene)ethylidene]-4-thiazolidinone MLS000584397 cid_12005182
Type:
Small organic molecule
Emp. Form.:
C19H20N2OS2
Mol. Mass.:
356.505
SMILES:
CN1\C(=C\C=C2\SC(=S)N(CC=C)C2=O)C(C)(C)c2ccccc12
: