Target
DNA (cytosine-5)-methyltransferase 3A
Ligand
BDBM46217
Substrate
Meas. Tech.
SAR Selectivity Analysis of small molecule inhibitors of PEST using pCAP in a fluorescence assay
IC50
9450±n/a nM
Citation
 PubChem, PC SAR Selectivity Analysis of small molecule inhibitors of PEST using pCAP in a fluorescence assay PubChem Bioassay (2010)[AID] 
Target
Name:
DNA (cytosine-5)-methyltransferase 3A
Synonyms:
DNA (cytosine-5)-methyltransferase 3A DNA methyltransferase HsaIIIA DNMT3A M.HsaIIIA | tyrosine-protein phosphatase non-receptor type 12 isoform 2
Type:
PROTEIN
Mol. Mass.:
101857.24
Organism:
Homo sapiens (Human)
Description:
ChEMBL_1510405
Residue:
912
  
Inhibitor
Name:
BDBM46217
Synonyms:
2-(2-dibenzothiophenyloxy)-2-methylpropanoic acid 2-dibenzothiophen-2-yloxy-2-methyl-propionic acid MLS-0412044.0001 | cid_901652
Type:
Small organic molecule
Emp. Form.:
C16H14O3S
Mol. Mass.:
286.346
SMILES:
CC(C)(Oc1ccc2sc3ccccc3c2c1)C(O)=O
: