Target
DNA (cytosine-5)-methyltransferase 3A
Ligand
BDBM46269
Substrate
Meas. Tech.
SAR Selectivity Analysis of small molecule inhibitors of PEST using pCAP in a fluorescence assay
IC50
7860±n/a nM
Citation
 PubChem, PC SAR Selectivity Analysis of small molecule inhibitors of PEST using pCAP in a fluorescence assay PubChem Bioassay (2010)[AID] 
Target
Name:
DNA (cytosine-5)-methyltransferase 3A
Synonyms:
DNA (cytosine-5)-methyltransferase 3A DNA methyltransferase HsaIIIA DNMT3A M.HsaIIIA | tyrosine-protein phosphatase non-receptor type 12 isoform 2
Type:
PROTEIN
Mol. Mass.:
101857.24
Organism:
Homo sapiens (Human)
Description:
ChEMBL_1510405
Residue:
912
  
Inhibitor
Name:
BDBM46269
Synonyms:
2-[4-[(E)-[2-(3-bromoanilino)-4-keto-2-thiazolin-5-ylidene]methyl]-2-methoxy-phenoxy]acetic acid 2-[4-[(E)-[2-(3-bromoanilino)-4-oxo-5-thiazolylidene]methyl]-2-methoxyphenoxy]acetic acid MLS-0425581.0001 | cid_1228895
Type:
Small organic molecule
Emp. Form.:
C19H15BrN2O5S
Mol. Mass.:
463.302
SMILES:
COc1cc(C=C2SC(Nc3cccc(Br)c3)=NC2=O)ccc1OCC(O)=O
: