Target
DNA (cytosine-5)-methyltransferase 3A
Ligand
BDBM64828
Substrate
Meas. Tech.
SAR Selectivity Analysis of small molecule inhibitors of PEST using pCAP in a fluorescence assay
IC50
17900±n/a nM
Citation
 PubChem, PC SAR Selectivity Analysis of small molecule inhibitors of PEST using pCAP in a fluorescence assay PubChem Bioassay (2010)[AID] 
Target
Name:
DNA (cytosine-5)-methyltransferase 3A
Synonyms:
DNA (cytosine-5)-methyltransferase 3A DNA methyltransferase HsaIIIA DNMT3A M.HsaIIIA | tyrosine-protein phosphatase non-receptor type 12 isoform 2
Type:
PROTEIN
Mol. Mass.:
101857.24
Organism:
Homo sapiens (Human)
Description:
ChEMBL_1510405
Residue:
912
  
Inhibitor
Name:
BDBM64828
Synonyms:
2-hydroxy-4-[4-[(5Z)-4-keto-2-thioxo-5-veratrylidene-thiazolidin-3-yl]butanoylamino]benzoic acid 4-[4-[(5Z)-5-[(3,4-dimethoxyphenyl)methylidene]-4-oxo-2-sulfanylidene-1,3-thiazolidin-3-yl]butanoylamino]-2-hydroxybenzoic acid MLS-0435437.0001 | cid_6202912
Type:
Small organic molecule
Emp. Form.:
C23H22N2O7S2
Mol. Mass.:
502.56
SMILES:
COc1ccc(\C=C2/SC(=S)N(CCCC(=O)Nc3ccc(C(O)=O)c(O)c3)C2=O)cc1OC
: