Target
Sentrin-specific protease 8
Ligand
BDBM43662
Substrate
Meas. Tech.
Dose Response confirmation of uHTS for inhibitors of Sentrin-specific protease 8 (SENP8) using a Luminescent assay
IC50
94800±n/a nM
Citation
 PubChem, PC Dose Response confirmation of uHTS for inhibitors of Sentrin-specific protease 8 (SENP8) using a Luminescent assay PubChem Bioassay (2010)[AID] 
Target
Name:
Sentrin-specific protease 8
Synonyms:
DEN1 PRSC2 SENP8_HUMAN | SUMO/sentrin specific peptidase family member 8
Type:
Enzyme Catalytic Domain
Mol. Mass.:
24104.52
Organism:
Homo sapiens (Human)
Description:
gi_262118306
Residue:
212
  
Inhibitor
Name:
BDBM43662
Synonyms:
3-phenyl-7-propan-2-yloxy-1-benzopyran-4-one 3-phenyl-7-propan-2-yloxychromen-4-one IPRIFLAVONE SMR000059060 | cid_3747
Type:
Small organic molecule
Emp. Form.:
C18H16O3
Mol. Mass.:
280.3178
SMILES:
CC(C)Oc1ccc2c(c1)occ(-c1ccccc1)c2=O
: