Target
Alkaline phosphatase, tissue-nonspecific isozyme
Ligand
BDBM39617
Substrate
Meas. Tech.
Dose Response confirmation of uHTS inhibitors of Mouse Intestinal Alkaline Phosphatase using Tissue Nonspecific Alkaline Phosphatase.
IC50
25800±n/a nM
Citation
 PubChem, PC Dose Response confirmation of uHTS inhibitors of Mouse Intestinal Alkaline Phosphatase using Tissue Nonspecific Alkaline Phosphatase. PubChem Bioassay (2010)[AID] 
Target
Name:
Alkaline phosphatase, tissue-nonspecific isozyme
Synonyms:
ALPL tissue-nonspecific alkaline phosphatase precursor
Type:
PROTEIN
Mol. Mass.:
57306.17
Organism:
Homo sapiens (Human)
Description:
ChEMBL_1448917
Residue:
524
  
Inhibitor
Name:
BDBM39617
Synonyms:
3-[5-(methylamino)-1,3,4-thiadiazol-2-yl]-1-benzopyran-2-one 3-[5-(methylamino)-1,3,4-thiadiazol-2-yl]chromen-2-one MLS000094728 cid_3244772
Type:
Small organic molecule
Emp. Form.:
C12H9N3O2S
Mol. Mass.:
259.284
SMILES:
CNc1nnc(s1)-c1cc2ccccc2oc1=O
: