Target
Alkaline phosphatase, tissue-nonspecific isozyme
Ligand
BDBM76174
Substrate
Meas. Tech.
Dose Response confirmation of uHTS inhibitors of Mouse Intestinal Alkaline Phosphatase using Tissue Nonspecific Alkaline Phosphatase.
IC50
12200±n/a nM
Citation
 PubChem, PC Dose Response confirmation of uHTS inhibitors of Mouse Intestinal Alkaline Phosphatase using Tissue Nonspecific Alkaline Phosphatase. PubChem Bioassay (2010)[AID] 
Target
Name:
Alkaline phosphatase, tissue-nonspecific isozyme
Synonyms:
ALPL tissue-nonspecific alkaline phosphatase precursor
Type:
PROTEIN
Mol. Mass.:
57306.17
Organism:
Homo sapiens (Human)
Description:
ChEMBL_1448917
Residue:
524
  
Inhibitor
Name:
BDBM76174
Synonyms:
1-(3,5-dimethoxyphenyl)-3-(3,3-diphenylpropyl)thiourea N-(3,5-dimethoxyphenyl)-N'-(3,3-diphenylpropyl)thiourea cid_1323304
Type:
Small organic molecule
Emp. Form.:
C24H26N2O2S
Mol. Mass.:
406.54
SMILES:
COc1cc(NC(=S)NCCC(c2ccccc2)c2ccccc2)cc(OC)c1
: