Target
Alkaline phosphatase, tissue-nonspecific isozyme
Ligand
BDBM57462
Substrate
Meas. Tech.
Dose Response confirmation of uHTS inhibitors of Mouse Intestinal Alkaline Phosphatase using Tissue Nonspecific Alkaline Phosphatase.
IC50
22900±n/a nM
Citation
 PubChem, PC Dose Response confirmation of uHTS inhibitors of Mouse Intestinal Alkaline Phosphatase using Tissue Nonspecific Alkaline Phosphatase. PubChem Bioassay (2010)[AID] 
Target
Name:
Alkaline phosphatase, tissue-nonspecific isozyme
Synonyms:
ALPL tissue-nonspecific alkaline phosphatase precursor
Type:
PROTEIN
Mol. Mass.:
57306.17
Organism:
Homo sapiens (Human)
Description:
ChEMBL_1448917
Residue:
524
  
Inhibitor
Name:
BDBM57462
Synonyms:
1-(3-chlorophenyl)-3-(3,3-diphenylpropyl)thiourea N-(3-chlorophenyl)-N'-(3,3-diphenylpropyl)thiourea cid_1336020
Type:
Small organic molecule
Emp. Form.:
C22H21ClN2S
Mol. Mass.:
380.934
SMILES:
Clc1cccc(NC(=S)NCCC(c2ccccc2)c2ccccc2)c1
: