Target
Alkaline phosphatase, tissue-nonspecific isozyme
Ligand
BDBM46609
Substrate
Meas. Tech.
Dose Response confirmation of uHTS inhibitors of Mouse Intestinal Alkaline Phosphatase using Tissue Nonspecific Alkaline Phosphatase.
IC50
8850±n/a nM
Citation
 PubChem, PC Dose Response confirmation of uHTS inhibitors of Mouse Intestinal Alkaline Phosphatase using Tissue Nonspecific Alkaline Phosphatase. PubChem Bioassay (2010)[AID] 
Target
Name:
Alkaline phosphatase, tissue-nonspecific isozyme
Synonyms:
ALPL tissue-nonspecific alkaline phosphatase precursor
Type:
PROTEIN
Mol. Mass.:
57306.17
Organism:
Homo sapiens (Human)
Description:
ChEMBL_1448917
Residue:
524
  
Inhibitor
Name:
BDBM46609
Synonyms:
1,3-bis(1H-1,2,4-triazol-5-ylsulfanyl)propan-2-one 1,3-bis(1H-1,2,4-triazol-5-ylthio)acetone cid_1625367
Type:
Small organic molecule
Emp. Form.:
C7H8N6OS2
Mol. Mass.:
256.308
SMILES:
O=C(CSc1nnc[nH]1)CSc1nnc[nH]1
: