Target
Alkaline phosphatase, tissue-nonspecific isozyme
Ligand
BDBM76182
Substrate
Meas. Tech.
Dose Response confirmation of uHTS inhibitors of Mouse Intestinal Alkaline Phosphatase using Tissue Nonspecific Alkaline Phosphatase.
IC50
1530±n/a nM
Citation
 PubChem, PC Dose Response confirmation of uHTS inhibitors of Mouse Intestinal Alkaline Phosphatase using Tissue Nonspecific Alkaline Phosphatase. PubChem Bioassay (2010)[AID] 
Target
Name:
Alkaline phosphatase, tissue-nonspecific isozyme
Synonyms:
ALPL tissue-nonspecific alkaline phosphatase precursor
Type:
PROTEIN
Mol. Mass.:
57306.17
Organism:
Homo sapiens (Human)
Description:
ChEMBL_1448917
Residue:
524
  
Inhibitor
Name:
BDBM76182
Synonyms:
1-(2-nitrophenyl)-3-[[(Z)-(3-oxidanyl-4-oxidanylidene-cyclohexa-2,5-dien-1-ylidene)methyl]amino]thiourea 1-[[(Z)-(3-hydroxy-4-oxo-1-cyclohexa-2,5-dienylidene)methyl]amino]-3-(2-nitrophenyl)thiourea MLS000417596 cid_16189676
Type:
Small organic molecule
Emp. Form.:
C14H12N4O4S
Mol. Mass.:
332.334
SMILES:
Oc1c[c-](C=[NH+]NC(=S)Nc2ccccc2[N+]([O-])=O)ccc1=O
: