Target
Alkaline phosphatase, tissue-nonspecific isozyme
Ligand
BDBM76184
Substrate
Meas. Tech.
Dose Response confirmation of uHTS inhibitors of Mouse Intestinal Alkaline Phosphatase using Tissue Nonspecific Alkaline Phosphatase.
IC50
21200±n/a nM
Citation
 PubChem, PC Dose Response confirmation of uHTS inhibitors of Mouse Intestinal Alkaline Phosphatase using Tissue Nonspecific Alkaline Phosphatase. PubChem Bioassay (2010)[AID] 
Target
Name:
Alkaline phosphatase, tissue-nonspecific isozyme
Synonyms:
ALPL tissue-nonspecific alkaline phosphatase precursor
Type:
PROTEIN
Mol. Mass.:
57306.17
Organism:
Homo sapiens (Human)
Description:
ChEMBL_1448917
Residue:
524
  
Inhibitor
Name:
BDBM76184
Synonyms:
4-[(2,9-dioxo-1,2,4,5,6,7,8,9-octahydropyrazolo[5,1-b]quinazolin-3-yl)diazenyl]benzenesulfonamide 4-[2-[2,9-bis(oxidanylidene)-5,6,7,8-tetrahydro-1H-pyrazolo[5,1-b]quinazolin-3-ylidene]hydrazinyl]benzenesulfonamide MLS000705743 cid_16189729
Type:
Small organic molecule
Emp. Form.:
C16H16N6O4S
Mol. Mass.:
388.401
SMILES:
NS(=O)(=O)c1ccc(cc1)N=Nc1c2[nH]c3CCCCc3c(=O)n2[nH]c1=O
: