Target
Alkaline phosphatase, tissue-nonspecific isozyme
Ligand
BDBM76186
Substrate
Meas. Tech.
Dose Response confirmation of uHTS inhibitors of Mouse Intestinal Alkaline Phosphatase using Tissue Nonspecific Alkaline Phosphatase.
IC50
11800±n/a nM
Citation
 PubChem, PC Dose Response confirmation of uHTS inhibitors of Mouse Intestinal Alkaline Phosphatase using Tissue Nonspecific Alkaline Phosphatase. PubChem Bioassay (2010)[AID] 
Target
Name:
Alkaline phosphatase, tissue-nonspecific isozyme
Synonyms:
ALPL tissue-nonspecific alkaline phosphatase precursor
Type:
PROTEIN
Mol. Mass.:
57306.17
Organism:
Homo sapiens (Human)
Description:
ChEMBL_1448917
Residue:
524
  
Inhibitor
Name:
BDBM76186
Synonyms:
6-ketobenzo[c]chromene-3,8-disulfonamide 6-oxo-6H-benzo[c]chromene-3,8-disulfonamide 6-oxobenzo[c]chromene-3,8-disulfonamide SMR000231864 | cid_1819919
Type:
Small organic molecule
Emp. Form.:
C13H10N2O6S2
Mol. Mass.:
354.358
SMILES:
NS(=O)(=O)c1ccc2c(c1)oc(=O)c1cc(ccc21)S(N)(=O)=O
: