Target
Alkaline phosphatase, tissue-nonspecific isozyme
Ligand
BDBM76187
Substrate
Meas. Tech.
Dose Response confirmation of uHTS inhibitors of Mouse Intestinal Alkaline Phosphatase using Tissue Nonspecific Alkaline Phosphatase.
IC50
24900±n/a nM
Citation
 PubChem, PC Dose Response confirmation of uHTS inhibitors of Mouse Intestinal Alkaline Phosphatase using Tissue Nonspecific Alkaline Phosphatase. PubChem Bioassay (2010)[AID] 
Target
Name:
Alkaline phosphatase, tissue-nonspecific isozyme
Synonyms:
ALPL tissue-nonspecific alkaline phosphatase precursor
Type:
PROTEIN
Mol. Mass.:
57306.17
Organism:
Homo sapiens (Human)
Description:
ChEMBL_1448917
Residue:
524
  
Inhibitor
Name:
BDBM76187
Synonyms:
MLS000690325 N-ethyl-2-oxidanylidene-N-phenyl-1,3-dihydrobenzimidazole-5-sulfonamide N-ethyl-2-oxo-N-phenyl-2,3-dihydro-1H-benzimidazole-5-sulfonamide cid_2955763
Type:
Small organic molecule
Emp. Form.:
C15H15N3O3S
Mol. Mass.:
317.363
SMILES:
CCN(c1ccccc1)S(=O)(=O)c1ccc2[nH]c(=O)[nH]c2c1
: