Target
Alkaline phosphatase, tissue-nonspecific isozyme
Ligand
BDBM52712
Substrate
Meas. Tech.
Dose Response confirmation of uHTS inhibitors of Mouse Intestinal Alkaline Phosphatase using Tissue Nonspecific Alkaline Phosphatase.
IC50
211±n/a nM
Citation
 PubChem, PC Dose Response confirmation of uHTS inhibitors of Mouse Intestinal Alkaline Phosphatase using Tissue Nonspecific Alkaline Phosphatase. PubChem Bioassay (2010)[AID] 
Target
Name:
Alkaline phosphatase, tissue-nonspecific isozyme
Synonyms:
ALPL tissue-nonspecific alkaline phosphatase precursor
Type:
PROTEIN
Mol. Mass.:
57306.17
Organism:
Homo sapiens (Human)
Description:
ChEMBL_1448917
Residue:
524
  
Inhibitor
Name:
BDBM52712
Synonyms:
(3E)-4-chloranyl-7-methyl-3-(5-oxidanylidene-2-sulfanylidene-imidazolidin-4-ylidene)-1H-indol-2-one (3E)-4-chloro-7-methyl-3-(5-oxo-2-sulfanylidene-4-imidazolidinylidene)-1H-indol-2-one (3Z)-4-chloro-7-methyl-3-(5-oxo-2-thioxoimidazolidin-4-ylidene)-1,3-dihydro-2H-indol-2-one SMR000313044 | cid_5413620
Type:
Small organic molecule
Emp. Form.:
C12H8ClN3O2S
Mol. Mass.:
293.729
SMILES:
Cc1ccc(Cl)c2\C(C(=O)Nc12)=C1/NC(=S)NC1=O
: