Target
Alkaline phosphatase, tissue-nonspecific isozyme
Ligand
BDBM52920
Substrate
Meas. Tech.
Dose Response confirmation of uHTS inhibitors of Mouse Intestinal Alkaline Phosphatase using Tissue Nonspecific Alkaline Phosphatase.
IC50
23500±n/a nM
Citation
 PubChem, PC Dose Response confirmation of uHTS inhibitors of Mouse Intestinal Alkaline Phosphatase using Tissue Nonspecific Alkaline Phosphatase. PubChem Bioassay (2010)[AID] 
Target
Name:
Alkaline phosphatase, tissue-nonspecific isozyme
Synonyms:
ALPL tissue-nonspecific alkaline phosphatase precursor
Type:
PROTEIN
Mol. Mass.:
57306.17
Organism:
Homo sapiens (Human)
Description:
ChEMBL_1448917
Residue:
524
  
Inhibitor
Name:
BDBM52920
Synonyms:
(5E)-5-[(E)-3-(2-furanyl)prop-2-enylidene]-1-methyl-2-sulfanylidene-1,3-diazinane-4,6-dione (5E)-5-[(E)-3-(furan-2-yl)prop-2-enylidene]-1-methyl-2-sulfanylidene-1,3-diazinane-4,6-dione MLS000779344 cid_1906043
Type:
Small organic molecule
Emp. Form.:
C12H10N2O3S
Mol. Mass.:
262.284
SMILES:
CN1C(=S)NC(=O)\C(=C/C=C/c2ccco2)C1=O
: