Target
Alkaline phosphatase, tissue-nonspecific isozyme
Ligand
BDBM53091
Substrate
Meas. Tech.
Dose Response confirmation of uHTS inhibitors of Mouse Intestinal Alkaline Phosphatase using Tissue Nonspecific Alkaline Phosphatase.
IC50
1120±n/a nM
Citation
 PubChem, PC Dose Response confirmation of uHTS inhibitors of Mouse Intestinal Alkaline Phosphatase using Tissue Nonspecific Alkaline Phosphatase. PubChem Bioassay (2010)[AID] 
Target
Name:
Alkaline phosphatase, tissue-nonspecific isozyme
Synonyms:
ALPL tissue-nonspecific alkaline phosphatase precursor
Type:
PROTEIN
Mol. Mass.:
57306.17
Organism:
Homo sapiens (Human)
Description:
ChEMBL_1448917
Residue:
524
  
Inhibitor
Name:
BDBM53091
Synonyms:
(2E)-5-nitro-6-oxidanyl-2-[(2Z)-2-(3-oxidanyl-4-oxidanylidene-cyclohexa-2,5-dien-1-ylidene)ethylidene]-1H-pyrimidin-4-one (2E)-6-hydroxy-2-[(2Z)-2-(3-hydroxy-4-oxo-1-cyclohexa-2,5-dienylidene)ethylidene]-5-nitro-1H-pyrimidin-4-one 2-[(Z)-2-(3,4-Dihydroxy-phenyl)-vinyl]-6-hydroxy-5-nitro-3H-pyrimidin-4-one SMR000524347 | cid_25043520
Type:
Small organic molecule
Emp. Form.:
C12H9N3O6
Mol. Mass.:
291.2164
SMILES:
Oc1[nH+]c(\C=C\[c-]2ccc(=O)c(O)c2)[nH]c(=O)c1[N+]([O-])=O
: