Target
Alkaline phosphatase, tissue-nonspecific isozyme
Ligand
BDBM76211
Substrate
Meas. Tech.
Dose Response confirmation of uHTS inhibitors of Mouse Intestinal Alkaline Phosphatase using Tissue Nonspecific Alkaline Phosphatase.
IC50
11800±n/a nM
Citation
 PubChem, PC Dose Response confirmation of uHTS inhibitors of Mouse Intestinal Alkaline Phosphatase using Tissue Nonspecific Alkaline Phosphatase. PubChem Bioassay (2010)[AID] 
Target
Name:
Alkaline phosphatase, tissue-nonspecific isozyme
Synonyms:
ALPL tissue-nonspecific alkaline phosphatase precursor
Type:
PROTEIN
Mol. Mass.:
57306.17
Organism:
Homo sapiens (Human)
Description:
ChEMBL_1448917
Residue:
524
  
Inhibitor
Name:
BDBM76211
Synonyms:
MLS001083154 N-[3-(3-chlorophenyl)phenyl]-1-cyclobutyl-isonipecotamide N-[3-(3-chlorophenyl)phenyl]-1-cyclobutylpiperidine-4-carboxamide cid_24790619
Type:
Small organic molecule
Emp. Form.:
C22H25ClN2O
Mol. Mass.:
368.9
SMILES:
Clc1cccc(c1)-c1cccc(NC(=O)C2CCN(CC2)C2CCC2)c1
: