Target
Alkaline phosphatase, tissue-nonspecific isozyme
Ligand
BDBM76214
Substrate
Meas. Tech.
Dose Response confirmation of uHTS inhibitors of Mouse Intestinal Alkaline Phosphatase using Tissue Nonspecific Alkaline Phosphatase.
IC50
22600±n/a nM
Citation
 PubChem, PC Dose Response confirmation of uHTS inhibitors of Mouse Intestinal Alkaline Phosphatase using Tissue Nonspecific Alkaline Phosphatase. PubChem Bioassay (2010)[AID] 
Target
Name:
Alkaline phosphatase, tissue-nonspecific isozyme
Synonyms:
ALPL tissue-nonspecific alkaline phosphatase precursor
Type:
PROTEIN
Mol. Mass.:
57306.17
Organism:
Homo sapiens (Human)
Description:
ChEMBL_1448917
Residue:
524
  
Inhibitor
Name:
BDBM76214
Synonyms:
CHEMBL1322977 N-(2,5-dimethylphenyl)-3-[(2-keto-3H-1,3-benzoxazol-6-yl)sulfonylamino]propionamide N-(2,5-dimethylphenyl)-3-[(2-oxo-3H-1,3-benzoxazol-6-yl)sulfonylamino]propanamide cid_24790980
Type:
Small organic molecule
Emp. Form.:
C18H19N3O5S
Mol. Mass.:
389.426
SMILES:
Cc1ccc(C)c(NC(=O)CCNS(=O)(=O)c2ccc3[nH]c(=O)oc3c2)c1
: