Target
Alkaline phosphatase, tissue-nonspecific isozyme
Ligand
BDBM76217
Substrate
Meas. Tech.
Dose Response confirmation of uHTS inhibitors of Mouse Intestinal Alkaline Phosphatase using Tissue Nonspecific Alkaline Phosphatase.
IC50
>100000±n/a nM
Citation
 PubChem, PC Dose Response confirmation of uHTS inhibitors of Mouse Intestinal Alkaline Phosphatase using Tissue Nonspecific Alkaline Phosphatase. PubChem Bioassay (2010)[AID] 
Target
Name:
Alkaline phosphatase, tissue-nonspecific isozyme
Synonyms:
ALPL tissue-nonspecific alkaline phosphatase precursor
Type:
PROTEIN
Mol. Mass.:
57306.17
Organism:
Homo sapiens (Human)
Description:
ChEMBL_1448917
Residue:
524
  
Inhibitor
Name:
BDBM76217
Synonyms:
MLS001096114 N-(2,5-dimethoxyphenyl)-3-[(2-oxidanylidene-3H-1,3-benzoxazol-6-yl)sulfonylamino]propanamide SMR000631041 | cid_24790986
Type:
Small organic molecule
Emp. Form.:
C18H19N3O7S
Mol. Mass.:
421.424
SMILES:
COc1ccc(OC)c(NC(=O)CCNS(=O)(=O)c2ccc3[nH]c(=O)oc3c2)c1
: