Target
Alkaline phosphatase, tissue-nonspecific isozyme
Ligand
BDBM76218
Substrate
Meas. Tech.
Dose Response confirmation of uHTS inhibitors of Mouse Intestinal Alkaline Phosphatase using Tissue Nonspecific Alkaline Phosphatase.
IC50
7870±n/a nM
Citation
 PubChem, PC Dose Response confirmation of uHTS inhibitors of Mouse Intestinal Alkaline Phosphatase using Tissue Nonspecific Alkaline Phosphatase. PubChem Bioassay (2010)[AID] 
Target
Name:
Alkaline phosphatase, tissue-nonspecific isozyme
Synonyms:
ALPL tissue-nonspecific alkaline phosphatase precursor
Type:
PROTEIN
Mol. Mass.:
57306.17
Organism:
Homo sapiens (Human)
Description:
ChEMBL_1448917
Residue:
524
  
Inhibitor
Name:
BDBM76218
Synonyms:
MLS001096133 N-(3-chlorophenyl)-2-[methyl-[(2-oxidanylidene-3H-1,3-benzoxazol-6-yl)sulfonyl]amino]ethanamide SMR000631033 | cid_20949398
Type:
Small organic molecule
Emp. Form.:
C16H14ClN3O5S
Mol. Mass.:
395.817
SMILES:
CN(CC(=O)Nc1cccc(Cl)c1)S(=O)(=O)c1ccc2[nH]c(=O)oc2c1
: