Target
Alkaline phosphatase, tissue-nonspecific isozyme
Ligand
BDBM76219
Substrate
Meas. Tech.
Dose Response confirmation of uHTS inhibitors of Mouse Intestinal Alkaline Phosphatase using Tissue Nonspecific Alkaline Phosphatase.
IC50
17800±n/a nM
Citation
 PubChem, PC Dose Response confirmation of uHTS inhibitors of Mouse Intestinal Alkaline Phosphatase using Tissue Nonspecific Alkaline Phosphatase. PubChem Bioassay (2010)[AID] 
Target
Name:
Alkaline phosphatase, tissue-nonspecific isozyme
Synonyms:
ALPL tissue-nonspecific alkaline phosphatase precursor
Type:
PROTEIN
Mol. Mass.:
57306.17
Organism:
Homo sapiens (Human)
Description:
ChEMBL_1448917
Residue:
524
  
Inhibitor
Name:
BDBM76219
Synonyms:
3-[(2-keto-3H-1,3-benzoxazol-6-yl)sulfonylamino]-N-phenyl-propionamide 3-[(2-oxo-3H-1,3-benzoxazol-6-yl)sulfonylamino]-N-phenylpropanamide SMR000631059 | cid_24792835
Type:
Small organic molecule
Emp. Form.:
C16H15N3O5S
Mol. Mass.:
361.372
SMILES:
O=C(CCNS(=O)(=O)c1ccc2[nH]c(=O)oc2c1)Nc1ccccc1
: