Target
Alkaline phosphatase, tissue-nonspecific isozyme
Ligand
BDBM76223
Substrate
Meas. Tech.
Dose Response confirmation of uHTS inhibitors of Mouse Intestinal Alkaline Phosphatase using Tissue Nonspecific Alkaline Phosphatase.
IC50
11800±n/a nM
Citation
 PubChem, PC Dose Response confirmation of uHTS inhibitors of Mouse Intestinal Alkaline Phosphatase using Tissue Nonspecific Alkaline Phosphatase. PubChem Bioassay (2010)[AID] 
Target
Name:
Alkaline phosphatase, tissue-nonspecific isozyme
Synonyms:
ALPL tissue-nonspecific alkaline phosphatase precursor
Type:
PROTEIN
Mol. Mass.:
57306.17
Organism:
Homo sapiens (Human)
Description:
ChEMBL_1448917
Residue:
524
  
Inhibitor
Name:
BDBM76223
Synonyms:
MLS001072189 N-[3-(3-fluorophenyl)phenyl]-1-[(5-methyl-1-propyl-pyrazol-4-yl)methyl]isonipecotamide N-[3-(3-fluorophenyl)phenyl]-1-[(5-methyl-1-propylpyrazol-4-yl)methyl]piperidine-4-carboxamide cid_24816646
Type:
Small organic molecule
Emp. Form.:
C26H31FN4O
Mol. Mass.:
434.5489
SMILES:
CCCn1ncc(CN2CCC(CC2)C(=O)Nc2cccc(c2)-c2cccc(F)c2)c1C
: