Target
Alkaline phosphatase, tissue-nonspecific isozyme
Ligand
BDBM76227
Substrate
Meas. Tech.
Dose Response confirmation of uHTS inhibitors of Mouse Intestinal Alkaline Phosphatase using Tissue Nonspecific Alkaline Phosphatase.
IC50
17800±n/a nM
Citation
 PubChem, PC Dose Response confirmation of uHTS inhibitors of Mouse Intestinal Alkaline Phosphatase using Tissue Nonspecific Alkaline Phosphatase. PubChem Bioassay (2010)[AID] 
Target
Name:
Alkaline phosphatase, tissue-nonspecific isozyme
Synonyms:
ALPL tissue-nonspecific alkaline phosphatase precursor
Type:
PROTEIN
Mol. Mass.:
57306.17
Organism:
Homo sapiens (Human)
Description:
ChEMBL_1448917
Residue:
524
  
Inhibitor
Name:
BDBM76227
Synonyms:
MLS001121840 N-[3-(3-chlorophenyl)phenyl]-1-[[5-(methoxymethyl)-2-furyl]methyl]isonipecotamide SMR000658174 | cid_24818948
Type:
Small organic molecule
Emp. Form.:
C25H27ClN2O3
Mol. Mass.:
438.946
SMILES:
COCc1ccc(CN2CCC(CC2)C(=O)Nc2cccc(c2)-c2cccc(Cl)c2)o1
: