Target
Alkaline phosphatase, tissue-nonspecific isozyme
Ligand
BDBM76242
Substrate
Meas. Tech.
Dose Response confirmation of uHTS inhibitors of Mouse Intestinal Alkaline Phosphatase using Tissue Nonspecific Alkaline Phosphatase.
IC50
4720±n/a nM
Citation
 PubChem, PC Dose Response confirmation of uHTS inhibitors of Mouse Intestinal Alkaline Phosphatase using Tissue Nonspecific Alkaline Phosphatase. PubChem Bioassay (2010)[AID] 
Target
Name:
Alkaline phosphatase, tissue-nonspecific isozyme
Synonyms:
ALPL tissue-nonspecific alkaline phosphatase precursor
Type:
PROTEIN
Mol. Mass.:
57306.17
Organism:
Homo sapiens (Human)
Description:
ChEMBL_1448917
Residue:
524
  
Inhibitor
Name:
BDBM76242
Synonyms:
2-phenoxyacetic acid [2-[(5-nitro-2-thiazolyl)amino]-2-oxoethyl] ester MLS002171146 [2-[(5-nitro-1,3-thiazol-2-yl)amino]-2-oxidanylidene-ethyl] 2-phenoxyethanoate cid_4274507
Type:
Small organic molecule
Emp. Form.:
C13H11N3O6S
Mol. Mass.:
337.308
SMILES:
[O-][N+](=O)c1cnc(NC(=O)COC(=O)COc2ccccc2)s1
: