Target
Alkaline phosphatase, tissue-nonspecific isozyme
Ligand
BDBM76249
Substrate
Meas. Tech.
Dose Response confirmation of uHTS inhibitors of Mouse Intestinal Alkaline Phosphatase using Tissue Nonspecific Alkaline Phosphatase.
IC50
1060±n/a nM
Citation
 PubChem, PC Dose Response confirmation of uHTS inhibitors of Mouse Intestinal Alkaline Phosphatase using Tissue Nonspecific Alkaline Phosphatase. PubChem Bioassay (2010)[AID] 
Target
Name:
Alkaline phosphatase, tissue-nonspecific isozyme
Synonyms:
ALPL tissue-nonspecific alkaline phosphatase precursor
Type:
PROTEIN
Mol. Mass.:
57306.17
Organism:
Homo sapiens (Human)
Description:
ChEMBL_1448917
Residue:
524
  
Inhibitor
Name:
BDBM76249
Synonyms:
MLS002171184 [2-[(5-nitro-1,3-thiazol-2-yl)amino]-2-oxidanylidene-ethyl] benzoate benzoic acid [2-[(5-nitro-2-thiazolyl)amino]-2-oxoethyl] ester cid_5236900
Type:
Small organic molecule
Emp. Form.:
C12H9N3O5S
Mol. Mass.:
307.282
SMILES:
[O-][N+](=O)c1cnc(NC(=O)COC(=O)c2ccccc2)s1
: