Target
Protein kinase C beta type
Ligand
BDBM2712
Substrate
Lysine-rich histone
Meas. Tech.
PKC assay
IC50
9.8±n/a nM
Citation
 Bit, RADavis, PDElliott, LHHarris, WHill, CHKeech, EKumar, HLawton, GMaw, ANixon, JS Inhibitors of protein kinase C. 3. Potent and highly selective bisindolylmaleimides by conformational restriction. J Med Chem 36:21-9 (1993)  
Target
Name:
Protein kinase C beta type
Synonyms:
KPCB_RAT Pkcb Prkcb1 Protein kinase C (PKC) | Protein kinase C beta
Type:
Enzyme Mixture
Mol. Mass.:
76755.54
Organism:
Rattus norvegicus (rat)
Description:
PKC from rat brain is known to contain predominately the conventional PKC isoforms, alpha, beta I, beta II, gamma.
Residue:
671
  
Inhibitor
Name:
BDBM2712
Synonyms:
3-(1-methyl-1H-indol-3-yl)-4-{2-[(methylamino)methyl]-1H,2H,3H,4H-pyrido[1,2-a]indol-10-yl}-2,5-dihydro-1H-pyrrole-2,5-dione Bisindolylmaleimide deriv. 18a
Type:
Small organic molecule
Emp. Form.:
C27H26N4O2
Mol. Mass.:
438.5209
SMILES:
CNCC1CCn2c(C1)c(C1=C(C(=O)NC1=O)c1cn(C)c3ccccc13)c1ccccc21
:
Substrate
Name:
Lysine-rich histone
Synonyms:
ING Peptide histone type IIIS
Type:
Peptide
Mol. Mass.:
10508.21
Organism:
Bos taurus (bovine)
Description:
Purified as a lysine rich fraction of histone H1 from calf thymus.
Residue:
105