Target
X-box-binding protein 1
Ligand
BDBM67998
Substrate
Meas. Tech.
XBP1 DR counterscreen for CHOP
IC50
160±n/a nM
Citation
 PubChem, PC XBP1 DR counterscreen for CHOP PubChem Bioassay (2011)[AID] 
Target
Name:
X-box-binding protein 1
Synonyms:
TREB5 XBP1_HUMAN | XBP2
Type:
Enzyme Catalytic Domain
Mol. Mass.:
28704.14
Organism:
Homo sapiens (Human)
Description:
gi_47678753
Residue:
261
  
Inhibitor
Name:
BDBM67998
Synonyms:
(E)-2-cyano-N-(2,3-dimethylphenyl)-3-[1-[2-(2-furanylmethylamino)-2-oxoethyl]-3-indolyl]-2-propenamide (E)-2-cyano-N-(2,3-dimethylphenyl)-3-[1-[2-(furan-2-ylmethylamino)-2-oxidanylidene-ethyl]indol-3-yl]prop-2-enamide 2-Cyano-N-(2,3-dimethyl-phenyl)-3-(1-{[(furan-2-ylmethyl)-carbamoyl]-methyl}-1H-indol-3-yl)-acrylamide SMR000177748 | cid_1140634
Type:
Small organic molecule
Emp. Form.:
C27H24N4O3
Mol. Mass.:
452.5045
SMILES:
Cc1cccc(NC(=O)C(=C\c2cn(CC(=O)NCc3ccco3)c3ccccc23)\C#N)c1C
: