Target
DNA damage-inducible transcript 3 protein
Ligand
BDBM62439
Substrate
Meas. Tech.
CHOP dose-response primary assay
IC50
170±n/a nM
Citation
 PubChem, PC CHOP dose-response primary assay PubChem Bioassay (2011)[AID] 
Target
Name:
DNA damage-inducible transcript 3 protein
Synonyms:
Chop DDIT3_MOUSE Gadd153
Type:
Enzyme Catalytic Domain
Mol. Mass.:
19175.17
Organism:
Mus musculus
Description:
gi_160707929
Residue:
168
  
Inhibitor
Name:
BDBM62439
Synonyms:
MLS000570595 N-[[(E)-3-(1,3-benzodioxol-5-yl)prop-2-enylidene]amino]-2-(2,3-dimethylphenoxy)acetamide SMR000187020 | cid_2263315
Type:
Small organic molecule
Emp. Form.:
C20H20N2O4
Mol. Mass.:
352.3838
SMILES:
Cc1cccc(OCC(=O)NN=C\C=C\c2ccc3OCOc3c2)c1C
: