Target
DNA damage-inducible transcript 3 protein
Ligand
BDBM64806
Substrate
Meas. Tech.
CHOP dose-response primary assay
IC50
260±n/a nM
Citation
 PubChem, PC CHOP dose-response primary assay PubChem Bioassay (2011)[AID] 
Target
Name:
DNA damage-inducible transcript 3 protein
Synonyms:
Chop DDIT3_MOUSE Gadd153
Type:
Enzyme Catalytic Domain
Mol. Mass.:
19175.17
Organism:
Mus musculus
Description:
gi_160707929
Residue:
168
  
Inhibitor
Name:
BDBM64806
Synonyms:
MLS-0310259.0001 N-(4-hydroxyphenyl)-4-[(5E)-5-[(4-methoxyphenyl)methylidene]-4-oxidanylidene-2-sulfanylidene-1,3-thiazolidin-3-yl]butanamide N-(4-hydroxyphenyl)-4-[(5E)-5-[(4-methoxyphenyl)methylidene]-4-oxo-2-sulfanylidene-3-thiazolidinyl]butanamide | cid_1356906
Type:
Small organic molecule
Emp. Form.:
C21H20N2O4S2
Mol. Mass.:
428.524
SMILES:
COc1ccc(\C=C2\SC(=S)N(CCCC(=O)Nc3ccc(O)cc3)C2=O)cc1
: