Target
Caspase-3
Ligand
BDBM66459
Substrate
Meas. Tech.
Dose response counterscreen for dual activators of procaspase-3 and procaspase-7: Absorbance-based biochemical high throughput screening assay to identify activators of procaspase-3
EC50
>85267±n/a nM
Citation
 PubChem, PC Dose response counterscreen for dual activators of procaspase-3 and procaspase-7: Absorbance-based biochemical high throughput screening assay to identify activators of procaspase-3 PubChem Bioassay (2011)[AID] 
Target
Name:
Caspase-3
Synonyms:
Apopain CASP3 CPP-32 Caspase 3 Caspase-3 subunit p17 SCA-1 Yama protein | caspase-3 preproprotein
Type:
Hydrolase; heterotetramer of two heterodimers
Mol. Mass.:
31607.55
Organism:
Homo sapiens (Human)
Description:
Residue:
277
  
Inhibitor
Name:
BDBM66459
Synonyms:
(6,7-dimethoxy-1-methyl-3,4-dihydro-1H-isoquinolin-2-yl)-(4H-thieno[3,2-c][1]benzopyran-2-yl)methanone 6,7-dimethoxy-1-methyl-2-(4H-thieno[3,2-c]chromen-2-ylcarbonyl)-1,2,3,4-tetrahydroisoquinoline SMR000208824 | cid_15944690
Type:
Small organic molecule
Emp. Form.:
C24H23NO4S
Mol. Mass.:
421.509
SMILES:
COc1cc2CCN(C(C)c2cc1OC)C(=O)c1cc2COc3ccccc3-c2s1
: