Target
BRCA1-associated RING domain protein 1
Ligand
BDBM70514
Substrate
Meas. Tech.
Dose Response confirmation of Inhibitors of Mdm2/MdmX interaction using a Brca1/Bard1 BiLC Counterscreen assay
IC50
12300±n/a nM
Citation
 PubChem, PC Dose Response confirmation of Inhibitors of Mdm2/MdmX interaction using a Brca1/Bard1 BiLC Counterscreen assay PubChem Bioassay (2011)[AID] 
Target
Name:
BRCA1-associated RING domain protein 1
Synonyms:
BARD-1 BARD1_HUMAN
Type:
Enzyme Catalytic Domain
Mol. Mass.:
86678.08
Organism:
Homo sapiens (Human)
Description:
gi_116241265
Residue:
777
  
Inhibitor
Name:
BDBM70514
Synonyms:
2-[(1-methyl-3-nitro-1H-1,2,4-triazol-5-yl)thio]-5-phenyl-1,3,4-oxadiazole 2-[(2-methyl-5-nitro-1,2,4-triazol-3-yl)thio]-5-phenyl-1,3,4-oxadiazole SMR000142674 | cid_890456
Type:
Small organic molecule
Emp. Form.:
C11H8N6O3S
Mol. Mass.:
304.285
SMILES:
Cn1nc(nc1Sc1nnc(o1)-c1ccccc1)[N+]([O-])=O
: