Target
Bcl-2-related protein A1
Ligand
BDBM60229
Substrate
Meas. Tech.
Dose Response confirmation of UBC13 Polyubiquitin Inhibitors using a Bfl-1 counterscreen
IC50
>20000±0 nM
Citation
 PubChem, PC Dose Response confirmation of UBC13 Polyubiquitin Inhibitors using a Bfl-1 counterscreen PubChem Bioassay (2011)[AID] 
Target
Name:
Bcl-2-related protein A1
Synonyms:
A1 B-cell leukemia/lymphoma 2 related protein A1a Bcl2a1 Bfl-1 Hemopoietic-specific early response protein | Protein BFL-1
Type:
Apoptosis regulator protein
Mol. Mass.:
19909.74
Organism:
Mus musculus (Mouse)
Description:
gi_11024684
Residue:
172
  
Inhibitor
Name:
BDBM60229
Synonyms:
MLS000568342 N-[[(4-propoxybenzoyl)amino]carbamothioyl]propanamide N-[[(4-propoxyphenyl)carbonylamino]carbamothioyl]propanamide SMR000177383 | cid_1728272
Type:
Small organic molecule
Emp. Form.:
C14H19N3O3S
Mol. Mass.:
309.384
SMILES:
CCCOc1ccc(cc1)C(=O)NNC(=S)NC(=O)CC
: