Target
DNA dC->dU-editing enzyme APOBEC-3G
Ligand
BDBM61355
Substrate
Meas. Tech.
Dose Response confirmation of APOBEC3A DNA Deaminase Inhibitors via a A3G counterscreen
Temperature
298.15±n/a K
IC50
4150±202 nM
Comments
extracted
Citation
 PubChem, PC Dose Response confirmation of APOBEC3A DNA Deaminase Inhibitors via a A3G counterscreen PubChem Bioassay (2011)[AID] 
Target
Name:
DNA dC->dU-editing enzyme APOBEC-3G
Synonyms:
ABC3G_HUMAN | APOBEC3G
Type:
Enzyme Catalytic Domain
Mol. Mass.:
46419.54
Organism:
Homo sapiens (Human)
Description:
gi_13399304
Residue:
384
  
Inhibitor
Name:
BDBM61355
Synonyms:
5-ethyl-6-keto-benzo[b][1,4]benzothiazepine-3-carboxylic acid ethyl ester MLS001200975 cid_4083983 ethyl 5-ethyl-6-oxidanylidene-benzo[b][1,4]benzothiazepine-3-carboxylate | ethyl 5-ethyl-6-oxobenzo[b][1,4]benzothiazepine-3-carboxylate
Type:
Small organic molecule
Emp. Form.:
C18H17NO3S
Mol. Mass.:
327.397
SMILES:
CCOC(=O)c1ccc2Sc3ccccc3C(=O)N(CC)c2c1
: