Target
C-C chemokine receptor type 6
Ligand
BDBM42069
Substrate
Meas. Tech.
Dose Response confirmation of small molecule antagonists of the CCR6 receptor: a luminescent beta-arrestin assay
IC50
24100±n/a nM
Citation
 PubChem, PC Dose Response confirmation of small molecule antagonists of the CCR6 receptor: a luminescent beta-arrestin assay PubChem Bioassay (2011)[AID] 
Target
Name:
C-C chemokine receptor type 6
Synonyms:
C-C chemokine receptor type 6 CCR6 CKRL3 GPR29 | STRL22
Type:
Enzyme
Mol. Mass.:
42510.84
Organism:
Homo sapiens (Human)
Description:
P51684
Residue:
374
  
Inhibitor
Name:
BDBM42069
Synonyms:
2-acetamido-4,5-dinitro-benzoic acid ethyl ester MLS000698400 cid_4104905 ethyl 2-acetamido-4,5-dinitro-benzoate | ethyl 2-acetamido-4,5-dinitrobenzoate
Type:
Small organic molecule
Emp. Form.:
C11H11N3O7
Mol. Mass.:
297.2209
SMILES:
CCOC(=O)c1cc(c(cc1NC(C)=O)[N+]([O-])=O)[N+]([O-])=O
: