Target
Nicotinate-nucleotide adenylyltransferase
Ligand
BDBM81362
Substrate
Meas. Tech.
Enzymatic Inhibition Assay
IC50
1.91e+5±n/a nM
Citation
 Sorci, LPan, YEyobo, YRodionova, IHuang, NKurnasov, OZhong, SMacKerell, ADZhang, HOsterman, AL Targeting NAD biosynthesis in bacterial pathogens: Structure-based development of inhibitors of nicotinate mononucleotide adenylyltransferase NadD. Chem Biol 16:849-61 (2009)  
Target
Name:
Nicotinate-nucleotide adenylyltransferase
Synonyms:
Deamido-NAD(+) pyrophosphorylase Nicotinate mononucleotide adenylyltransferase (NadD) nadD | ybeN
Type:
Enzyme
Mol. Mass.:
24523.61
Organism:
Escherichia coli
Description:
P0A752
Residue:
213
  
Inhibitor
Name:
BDBM81362
Synonyms:
NadD inhibitor 15_11 | US8785499, 15_11
Type:
Small organic molecule
Emp. Form.:
C17H14N2O3
Mol. Mass.:
294.3047
SMILES:
COC(=O)c1ccc(cc1)N=CC1C(=O)Nc2ccccc12
: