Target
Tyrosine-protein kinase Blk
Ligand
BDBM81377
Substrate
Meas. Tech.
In Vitro Activity Kinase Assay
IC50
381±0.0 nM
Kd
65±0.0 nM
Citation
 Zhou, WHur, WMcDermott, UDutt, AXian, WFicarro, SBZhang, JSharma, SVBrugge, JMeyerson, MSettleman, JGray, NS A structure-guided approach to creating covalent FGFR inhibitors. Chem Biol 17:285-95 (2010)  
Target
Name:
Tyrosine-protein kinase Blk
Synonyms:
B lymphoid tyrosine kinase BLK_HUMAN Tyrosine-protein kinase BLK (BLK) | p55-Blk
Type:
Protein
Mol. Mass.:
57711.88
Organism:
Homo sapiens (Human)
Description:
P51451
Residue:
505
  
Inhibitor
Name:
BDBM81377
Synonyms:
FIIN-1
Type:
Small organic molecule
Emp. Form.:
C30H35Cl2N7O4
Mol. Mass.:
628.549
SMILES:
CCNCCCCNc1ncc2CN(C(=O)N(Cc3cccc(NC(=O)C=C)c3)c2n1)c1c(Cl)c(OC)cc(OC)c1Cl
: