Target
Mast/stem cell growth factor receptor Kit
Ligand
BDBM81377
Substrate
Meas. Tech.
In Vitro Activity Kinase Assay
Kd
420±0.0 nM
Citation
 Zhou, WHur, WMcDermott, UDutt, AXian, WFicarro, SBZhang, JSharma, SVBrugge, JMeyerson, MSettleman, JGray, NS A structure-guided approach to creating covalent FGFR inhibitors. Chem Biol 17:285-95 (2010)  
Target
Name:
Mast/stem cell growth factor receptor Kit
Synonyms:
CD117 antigen KIT Mast/stem cell growth factor receptor Kit (cKIT) Proto-oncogene tyrosine-protein kinase Kit Stem cell growth factor receptor Tyrosine-protein kinase Kit c-kit v-kit Hardy-Zuckerman 4 feline sarcoma viral oncogene homolog
Type:
Protein
Mol. Mass.:
109869.37
Organism:
Homo sapiens (Human)
Description:
P10721
Residue:
976
  
Inhibitor
Name:
BDBM81377
Synonyms:
FIIN-1
Type:
Small organic molecule
Emp. Form.:
C30H35Cl2N7O4
Mol. Mass.:
628.549
SMILES:
CCNCCCCNc1ncc2CN(C(=O)N(Cc3cccc(NC(=O)C=C)c3)c2n1)c1c(Cl)c(OC)cc(OC)c1Cl
: