Target
Alpha-1A adrenergic receptor
Ligand
BDBM81459
Substrate
Ki
39000±n/a nM
Comments
PDSP_20601
Citation
 U'Prichard, DCGreenberg, DASnyder, SH Binding characteristics of a radiolabeled agonist and antagonist at central nervous system alpha noradrenergic receptors. Mol Pharmacol 13:454-73 (1977) Target
Name:
Alpha-1A adrenergic receptor
Synonyms:
ADA1A_RAT Adra1c Alpha-1A adrenoceptor Alpha-1C adrenergic receptor | adrenergic Alpha1A
Type:
Protein
Mol. Mass.:
51620.15
Organism:
Rattus norvegicus (Rat)
Description:
P43140
Residue:
466
  
Inhibitor
Name:
BDBM81459
Synonyms:
4-(2-aminopropyl)phenol;hydrobromide Hydroxyamphetamine,(+/-) | NSC_3651
Type:
Small organic molecule
Emp. Form.:
C9H13NO
Mol. Mass.:
151.2056
SMILES:
CC(N)Cc1ccc(O)cc1
: